{"text_format":"1","workbook":"xlsx","n_sheets":15,"sheets":["Index","Control","Participant Information","SCR Structure","SCR Summary","MCR Summary","Operational Risk","Economic Balance Sheet","Own Funds","Market Risk","Counterparty Default Risk","Life Underwriting Risk","Health Underwriting Risk","Data","Raw Data"],"not_rendered":{"charts":0,"images":0,"macros":1,"external_links":1,"defined_names":396,"comments":1,"pivot_tables":0},"unopened":[],"bounds":{"document_bytes":16777216,"sheet_cells":100000,"rows_first":2000,"rows_last":500,"rows_between":2000,"halvings":0,"cell_chars":16384,"cell_head_chars":4096},"cells_cut":0,"cells_raw":0,"read":"whole","date_system":"1900"}

{"sheet":"Index","index":0,"n_rows":53,"n_cols":6,"rows_kept":53,"cut":false,"hidden":false,"merged":[[3,1,11,5]]}
[{"$f":"RIGHT(CELL(\"filename\",$A$1),LEN(CELL(\"filename\",$A$1))-FIND(\"]\",CELL(\"filename\",$A$1)))","v":"Index"}]
[{"$f":"Insurer_Name & \" (\" & Insurer_Shortname & \")\"","v":" ()"},null,null,null,null,{"$f":"QIS_YE_Date","v":"00:00:00"}]
[]
[null,"This return \"QIS4_Total_Licensee Shortname\" is for completion by the insurer of the QIS4 results relating to all assets and liabilities of the insurer.\nIt should be submitted alongside the individual returns for each of the 4 lines of business, where applicable, as well as \"QIS3_5_Licensee Shortname\" (for assets and liabilities unrelated to any particular line of business).\nEach of the 5 individual returns will be amalgamated here by clicking on the \"Update Results\" macro button available on the \"Control\" tab.\nData should be entered in the \"Participant Information\", the Capital section of the \"Economic Balance Sheet\", \"Own Funds\" and \"Counterparty Default\" sheets - all other sheets will be populated by the macro.                             Throughout this return 'TS' refers to the Technical Specification TS17-03/T04"]
[]
[]
[]
[]
[]
[]
[]
[]
[]
[null,null,null,null,null,"Key"]
[]
{"$rows_left_out":39}
{"sheet":"Control","index":1,"n_rows":20,"n_cols":7,"rows_kept":20,"cut":false,"hidden":false,"merged":[[15,2,15,6],[16,2,16,6],[17,2,17,6],[18,2,18,6],[19,2,19,6]]}
[{"$f":"RIGHT(CELL(\"filename\",$A$1),LEN(CELL(\"filename\",$A$1))-FIND(\"]\",CELL(\"filename\",$A$1)))","v":"Control"}]
[{"$f":"Insurer_Name & \" (\" & Insurer_Shortname & \")\"","v":" ()"},null,null,null,null,null,{"$f":"QIS_YE_Date","v":"00:00:00"}]
[]
[]
[null,null,"QIS4 Returns to be submitted",null,"Folder Location",null,"Applicable?"]
[]
[null,null,{"$f":"\"QIS4_1_\"&Insurer_Shortname","v":"QIS4_1_"}]
[null,null,{"$f":"\"QIS4_2_\"&Insurer_Shortname","v":"QIS4_2_"}]
[null,null,{"$f":"\"QIS4_3_\"&Insurer_Shortname","v":"QIS4_3_"}]
[null,null,{"$f":"\"QIS4_4_\"&Insurer_Shortname","v":"QIS4_4_"}]
[null,null,{"$f":"\"QIS4_5_\"&Insurer_Shortname","v":"QIS4_5_"}]
[]
[]
[null,null,"File path for QIS4 returns"]
[]
{"$rows_left_out":6}
{"sheet":"Participant Information","index":2,"n_rows":37,"n_cols":10,"rows_kept":37,"cut":false,"hidden":false,"merged":[[9,3,9,5],[36,3,36,6],[18,3,18,6],[31,3,31,4],[27,3,27,5],[29,3,29,6]]}
[{"$f":"RIGHT(CELL(\"filename\",$A$1),LEN(CELL(\"filename\",$A$1))-FIND(\"]\",CELL(\"filename\",$A$1)))","v":"Participant Information"}]
[{"$f":"Insurer_Name & \" (\" & Insurer_Shortname & \")\"","v":" ()"},null,null,null,null,null,null,null,null,{"$f":"QIS_YE_Date","v":"00:00:00"}]
[]
[null,"QIS3 Information"]
[]
[null,"Date of submission",null,null,null,null,null,null,null,{"$f":"IF(D6=\"\",\"ERROR\",\"OK\")","v":"ERROR"}]
[]
[null,"Financial year end used",null,null,null,null,null,null,null,{"$f":"IF(D8=\"\",\"ERROR\",\"OK\")","v":"ERROR"}]
[]
[null,"Reporting currency",null,null,null,null,{"$f":"OFFSET(Data!C5,MATCH(D10,Data!B5:B76,0)-1,)","v":{"$error":"#N/A"}},null,null,{"$f":"IF(D10=\"\",\"ERROR\",\"OK\")","v":"ERROR"}]
[]
[null,"Exchange rate",null,null,null,null,null,null,null,{"$f":"IF(OR(AND($D$10=\"United Kingdom Pound\",$D$12<>1),AND($D$10<>\"United Kingdom Pound\",$D$12=1),D12=\"\"),\"ERROR\",\"OK\")","v":"ERROR"}]
[]
[null,"Reporting unit used",null,null,null,null,null,null,null,{"$f":"IF(D14=\"\",\"ERROR\",\"OK\")","v":"ERROR"}]
[]
{"$rows_left_out":23}
{"sheet":"SCR Structure","index":3,"n_rows":39,"n_cols":44,"rows_kept":39,"cut":false,"hidden":false,"merged":[[38,42,39,46],[35,3,36,6],[35,15,36,18],[35,21,36,24],[32,42,33,46],[35,42,36,46],[38,15,39,18],[29,3,30,6],[29,15,30,18],[29,21,30,24],[32,3,33,6],[32,15,33,18],[32,21,33,24],[26,3,27,6],[26,15,27,18],[26,21,27,24],[26,37,27,40],[12,37,13,40],[23,3,24,6],[23,15,24,18],[23,21,24,24],[23,31,24,34],[23,37,24,40],[12,43,13,46],[16,21,17,24],[16,26,17,29],[16,31,17,34],[20,3,21,6],[20,15,21,18],[20,21,21,24],[20,31,21,34],[20,37,21,40],[2,23,3,26],[7,15,8,18],[7,23,8,26],[7,31,8,34],[12,3,13,6],[12,9,13,12],[12,15,13,18],[12,26,13,29]]}
[]
[]
[null,null,null,null,null,null,null,null,null,null,null,null,null,null,null,null,null,null,null,null,null,null,null,"SCR"]
[]
[]
[]
[]
[null,null,null,null,null,null,null,null,null,null,null,null,null,null,null,"Adj",null,null,null,null,null,null,null,"BSCR",null,null,null,null,null,null,null,"Op"]
[]
[]
[]
[]
[null,null,null,"Market",null,null,null,null,null,"Default",null,null,null,null,null,"Life",null,null,null,null,null,null,null,null,null,null,"Health",null,null,null,null,null,null,null,null,null,null,"Non-Life",null,null,null,null,null,"Intangibles"]
[]
[]
{"$rows_left_out":25}
{"sheet":"SCR Summary","index":4,"n_rows":45,"n_cols":18,"rows_kept":45,"cut":false,"hidden":false,"merged":[]}
[{"$f":"RIGHT(CELL(\"filename\",$A$1),LEN(CELL(\"filename\",$A$1))-FIND(\"]\",CELL(\"filename\",$A$1)))","v":"SCR Summary"}]
[{"$f":"Insurer_Name & \" (\" & Insurer_Shortname & \")\"","v":" ()"},null,null,null,null,null,null,null,null,null,{"$f":"QIS_YE_Date","v":"00:00:00"}]
[null,null,null,null,null,null,null,null,null,null,null,null,null,"For info"]
[null,"Solvency Capital Requirement",null,null,null,"Capital",null,"nCapital",null,null,null,null,null,"Solvency Capital Requirement (25% Op Risk)",null,null,null,"Capital"]
[]
[null,"SCRmarket",null,null,null,{"$f":"SCR_Market","v":0},null,{"$f":"nSCR_Market","v":0},null,null,{"$f":"'Market Risk'!$S$17","v":"ERROR"},null,null,"SCRmarket",null,null,null,{"$f":"SCR_Market","v":0}]
[null,"SCRdefault",null,null,null,{"$f":"SCR_Default","v":0},null,{"$f":"nSCR_Default","v":0},null,null,{"$f":"'Counterparty Default Risk'!$O$6","v":"ERROR"},null,null,"SCRdefault",null,null,null,{"$f":"SCR_Default","v":0}]
[null,"SCRlife",null,null,null,{"$f":"SCR_Life","v":0},null,{"$f":"nSCR_Life","v":0},null,null,{"$f":"'Life Underwriting Risk'!S18","v":"ERROR"},null,null,"SCRlife",null,null,null,{"$f":"SCR_Life","v":0}]
[null,"SCRhealth",null,null,null,{"$f":"'Health Underwriting Risk'!SCR_Health","v":0},null,{"$f":"'Health Underwriting Risk'!nSCR_Health","v":0},null,null,null,null,null,"SCRhealth",null,null,null,{"$f":"'Health Underwriting Risk'!SCR_Health","v":0}]
[null,"SCRintangibles",null,null,"*",{"$f":"0.8*'Economic Balance Sheet'!$F$9","v":0},null,{"$f":"0.8*'Economic Balance Sheet'!$F$9","v":0},null,null,{"$f":"IF('Economic Balance Sheet'!$I$12=\"ZERO\",\"ZERO\",\"OK\")","v":"ZERO"},null,null,"SCRintangibles",null,null,"*",{"$f":"0.8*'Economic Balance Sheet'!$F$9","v":0}]
[]
[null,"BSCR (before diversification effects)",null,null,null,{"$f":"SUM(F6:F10)","v":0},null,{"$f":"SUM(H6:H10)","v":0},null,null,null,null,null,"BSCR (before diversification effects)",null,null,null,{"$f":"SUM(R6:R10)","v":0}]
[]
[null,"Diversification",null,null,"*",{"$f":"SQRT(MMULT(MMULT(TRANSPOSE(F6:F9),Corr),F6:F9))-SUM(F6:F9)","v":0},null,{"$f":"SQRT(MMULT(MMULT(TRANSPOSE(H6:H9),Corr),H6:H9))-SUM(H6:H9)","v":0},null,null,null,null,null,"Diversification",null,null,"*",{"$f":"SQRT(MMULT(MMULT(TRANSPOSE(R6:R9),Corr),R6:R9))-SUM(R6:R9)","v":0}]
[]
{"$rows_left_out":31}
{"sheet":"MCR Summary","index":5,"n_rows":51,"n_cols":9,"rows_kept":51,"cut":false,"hidden":false,"merged":[]}
[{"$f":"RIGHT(CELL(\"filename\",$A$1),LEN(CELL(\"filename\",$A$1))-FIND(\"]\",CELL(\"filename\",$A$1)))","v":"MCR Summary"}]
[{"$f":"Insurer_Name & \" (\" & Insurer_Shortname & \")\"","v":" ()"},null,null,null,null,null,null,null,{"$f":"QIS_YE_Date","v":"00:00:00"}]
[]
[null,"Solvency II Minimum Capital Requirement"]
[]
[null,"TPlife,1",null,null,"*",null,null,null,{"$f":"IF(F6=\"\",\"ERROR\",\"OK\")","v":"ERROR"}]
[null,"TPlife,2",null,null,"*",null,null,null,{"$f":"IF(F7=\"\",\"ERROR\",\"OK\")","v":"ERROR"}]
[null,"TPlife,3",null,null,"*",null,null,null,{"$f":"IF(F8=\"\",\"ERROR\",\"OK\")","v":"ERROR"}]
[null,"TPlife,4",null,null,"*",null,null,null,{"$f":"IF(F9=\"\",\"ERROR\",\"OK\")","v":"ERROR"}]
[null,"CAR",null,null,"*",null,null,null,{"$f":"IF(F10=\"\",\"ERROR\",\"OK\")","v":"ERROR"}]
[]
[null,"MCRlinear",null,null,null,{"$f":"0.037*F6-0.052*F7+0.007*F8+0.021*F9+0.0007*F10","v":0}]
[null,"MCRcombined",null,null,null,{"$f":"MIN(MAX(0.25*SCR,F12),0.45*SCR)","v":0},null,null,{"$f":"IF(OR('SCR Summary'!K43=\"ERROR\",F12=0),\"ERROR\",\"OK\")","v":"ERROR"}]
[]
[null,"AMCR",null,null,null,{"$f":"2.9*IF('Participant Information'!D14=\"Millions\",1,IF('Participant Information'!D14=\"Thousands\",1000,1000000))","v":2900000},null,null,{"$f":"IF(F15=0,\"ERROR\",\"OK\")","v":"OK"}]
{"$rows_left_out":37}
{"sheet":"Operational Risk","index":6,"n_rows":15,"n_cols":16,"rows_kept":15,"cut":false,"hidden":false,"merged":[]}
[{"$f":"RIGHT(CELL(\"filename\",$A$1),LEN(CELL(\"filename\",$A$1))-FIND(\"]\",CELL(\"filename\",$A$1)))","v":"Operational Risk"}]
[{"$f":"Insurer_Name & \" (\" & Insurer_Shortname & \")\"","v":" ()"},null,null,null,null,null,null,null,null,null,null,null,null,null,null,{"$f":"QIS_YE_Date","v":"00:00:00"}]
[]
[null,"Operational Risk",null,null,"2016 YE",null,"2015 YE",null,null,"EXPul 2016 YE",null,"EXPul 2015 YE",null,"Op_Premiums",null,"Op_Provisions"]
[]
[null,null,"Total expenses allocated to Unit Linked business",null,{"$f":"SUM(E7:E11)","v":0},null,{"$f":"SUM(G7:G11)","v":0},null,null,{"$f":"E6","v":0},null,{"$f":"G6","v":0}]
[null,null,"Renewal Commission:",null,{"$f":"'Raw Data'!I5","v":0},null,{"$f":"'Raw Data'!I10","v":0}]
[null,null,"Investment management expenses:",null,{"$f":"'Raw Data'!I6","v":0},null,{"$f":"'Raw Data'!I11","v":0}]
[null,null,"One-off expenses / development costs:",null,{"$f":"'Raw Data'!I7","v":0},null,{"$f":"'Raw Data'!I12","v":0}]
[null,null,"Fixed expenses/overheads:",null,{"$f":"'Raw Data'!I8","v":0},null,{"$f":"'Raw Data'!I13","v":0}]
[null,null,"Other:",null,{"$f":"'Raw Data'!I9","v":0},null,{"$f":"'Raw Data'!I14","v":0}]
[]
[null,null,"Earned Premiums 1",null,{"$f":"'Raw Data'!I15","v":0},null,{"$f":"'Raw Data'!I16","v":0},null,null,null,null,null,null,{"$f":"(0.04*E13)+MAX(0,0.04*(E13-1.2*G13))","v":0}]
[]
[null,null,"Technical Provisions ",null,{"$f":"'Raw Data'!I17","v":0},null,null,null,null,null,null,null,null,null,null,{"$f":"0.0045*MAX(E15,0)","v":0}]
{"$rows_left_out":1}
{"sheet":"Economic Balance Sheet","index":7,"n_rows":159,"n_cols":9,"rows_kept":159,"cut":false,"hidden":false,"merged":[]}
[{"$f":"RIGHT(CELL(\"filename\",$A$1),LEN(CELL(\"filename\",$A$1))-FIND(\"]\",CELL(\"filename\",$A$1)))","v":"Economic Balance Sheet"}]
[{"$f":"Insurer_Name & \" (\" & Insurer_Shortname & \")\"","v":" ()"},null,null,null,null,null,null,null,{"$f":"QIS_YE_Date","v":"00:00:00"}]
[]
[null,"Balance Sheet - Assets","*","Accounting basis        *",null,"Regulatory basis        *"]
[]
[null,"Fixed Assets"]
[]
[null,"Goodwill",null,{"$f":"'Raw Data'!$I$19","v":0},null,0]
[null,"Other intangible assets",null,{"$f":"'Raw Data'!$I$20","v":0},null,{"$f":"'Raw Data'!$I$21","v":0}]
[null,"Property, plant & equipment held for own use",null,{"$f":"'Raw Data'!$I$22","v":0},null,{"$f":"'Raw Data'!$I$23","v":0}]
[]
[null,"Total",null,{"$f":"SUM(D8:D10)","v":0},null,{"$f":"SUM(F8:F10)","v":0},null,null,{"$f":"IF(OR(SUMPRODUCT(D8:D10,D8:D10)=0,SUMPRODUCT(F8:F10,F8:F10)=0),\"ZERO\",\"OK\")","v":"ZERO"}]
[]
[null,"Investments (other than assets held for unit-linked funds)"]
[]
{"$rows_left_out":145}
{"sheet":"Own Funds","index":8,"n_rows":125,"n_cols":13,"rows_kept":125,"cut":false,"hidden":false,"merged":[]}
[{"$f":"RIGHT(CELL(\"filename\",$A$1),LEN(CELL(\"filename\",$A$1))-FIND(\"]\",CELL(\"filename\",$A$1)))","v":"Own Funds"}]
[{"$f":"Insurer_Name & \" (\" & Insurer_Shortname & \")\"","v":" ()"},null,null,null,null,null,null,null,null,null,null,null,{"$f":"QIS_YE_Date","v":"00:00:00"}]
[]
[null,"Basic Own Funds",null,"Tier 1",null,"Tier 2",null,"Tier 3",null,"Total"]
[]
[null,"Ordinary Share Capital (net of own shares)"]
[]
[null,"Paid up",null,null,null,null,null,0,null,{"$f":"SUM(D8,F8,H8)","v":0}]
[null,"Called up",null,0,null,null,null,0,null,{"$f":"SUM(D9,F9,H9)","v":0}]
[]
[null,"Total",null,{"$f":"SUM(D8:D9)","v":0},null,{"$f":"SUM(F8:F9)","v":0},null,{"$f":"SUM(H8:H9)","v":0},null,{"$f":"SUM(J8:J9)","v":0},null,null,{"$f":"IF(OR(ISBLANK(D8:D9),ISBLANK(F8:F9),ISBLANK(H8:H9)),\"ERROR\",\"OK\")","v":"OK"}]
[]
[null,"Initial Fund (less item of the same type held)"]
[]
[null,"Paid up",null,null,null,null,null,null,null,{"$f":"SUM(D15,F15,H15)","v":0}]
{"$rows_left_out":111}
{"sheet":"Market Risk","index":9,"n_rows":151,"n_cols":19,"rows_kept":151,"cut":false,"hidden":false,"merged":[]}
[{"$f":"RIGHT(CELL(\"filename\",$A$1),LEN(CELL(\"filename\",$A$1))-FIND(\"]\",CELL(\"filename\",$A$1)))","v":"Market Risk"}]
[{"$f":"Insurer_Name & \" (\" & Insurer_Shortname & \")\"","v":" ()"},null,null,null,null,null,null,null,null,null,null,null,null,null,null,null,null,null,{"$f":"QIS_YE_Date","v":"00:00:00"}]
[]
[null,"Market Risk",null,null,null,"Capital",null,"nCapital"]
[]
[null,"Marketinterest",null,null,"*",{"$f":"Mkt_Int","v":0},null,{"$f":"nMkt_Int","v":0},null,null,null,null,null,null,null,null,null,null,{"$f":"IF($S$27=\"ERROR\",\"ERROR\",IF($S$35=\"ZERO\",\"ZERO\",\"OK\"))","v":"ERROR"}]
[null,"Marketequity",null,null,"*",{"$f":"Mkt_Eq","v":0},null,{"$f":"nMkt_Eq","v":0},null,null,null,null,null,null,null,null,null,null,{"$f":"IF($S$27=\"ERROR\",\"ERROR\",IF($S$57=\"ZERO\",\"ZERO\",\"OK\"))","v":"ERROR"}]
[null,"Marketproperty",null,null,"*",{"$f":"Mkt_Prop","v":0},null,{"$f":"nMkt_Prop","v":0},null,null,null,null,null,null,null,null,null,null,{"$f":"IF($S$27=\"ERROR\",\"ERROR\",IF($S$62=\"ZERO\",\"ZERO\",\"OK\"))","v":"ERROR"}]
[null,"Marketfx",null,null,"*",{"$f":"IF(Curr_Simp=\"N\",Mkt_Curr,IF(Curr_Simp=\"Y\",Mkt_Curr_Simp,0))","v":0},null,{"$f":"IF(Curr_Simp=\"N\",nMkt_Curr,IF(Curr_Simp=\"Y\",nMkt_Curr_Simp,0))","v":0},null,null,null,null,null,null,null,null,null,null,{"$f":"IF($S$27=\"ERROR\",\"ERROR\",IF(OR(COUNTIF($S$67:$S$92,\"OK\")=COUNTA($S$67:$S$92),S132=\"OK\"),\"OK\",\"ZERO\"))","v":"ERROR"}]
[null,"Marketspread",null,null,"*",{"$f":"Mkt_Sp","v":0},null,{"$f":"nMkt_Sp","v":0},null,null,null,null,null,null,null,null,null,null,{"$f":"IF(OR($S$27=\"ERROR\",S137=\"ERROR\"),\"ERROR\",IF(COUNTIF($S$137:$S$142,\"ZERO\")=COUNTA($S$137:$S$142),\"ZERO\",\"OK\"))","v":"ERROR"}]
[null,"Marketconc",null,null,"*",{"$f":"Mkt_Conc","v":0},null,{"$f":"nMkt_Conc","v":0},null,null,null,null,null,null,null,null,null,null,{"$f":"IF($S$27=\"ERROR\",\"ERROR\",IF($S$151=\"ZERO\",\"ZERO\",\"OK\"))","v":"ERROR"}]
[]
[null,"Capital Requirement (before diversification effects)",null,null,null,{"$f":"SUM(F6:F11)","v":0},null,{"$f":"SUM(H6:H11)","v":0}]
[]
[null,"Diversification",null,null,null,{"$f":"F17-F13","v":0},null,{"$f":"H17-H13","v":0}]
{"$rows_left_out":137}
{"sheet":"Counterparty Default Risk","index":10,"n_rows":23,"n_cols":15,"rows_kept":23,"cut":false,"hidden":false,"merged":[]}
[{"$f":"RIGHT(CELL(\"filename\",$A$1),LEN(CELL(\"filename\",$A$1))-FIND(\"]\",CELL(\"filename\",$A$1)))","v":"Counterparty Default Risk"}]
[{"$f":"Insurer_Name & \" (\" & Insurer_Shortname & \")\"","v":" ()"},null,null,null,null,null,null,null,null,null,null,null,null,null,{"$f":"QIS_YE_Date","v":"00:00:00"}]
[]
[null,"Counterparty Default Risk",null,null,null,"Capital",null,"nCapital"]
[]
[null,"Capital Requirement (before diversification effects)",null,null,null,{"$f":"SUM(D20:D21)","v":0},null,{"$f":"SUM(F20:F21)","v":0},null,null,null,null,null,null,{"$f":"IF(OR($O$15=\"ERROR\",IF(ISERROR(MATCH(\"ERROR\",O20:O21,0)),FALSE,TRUE)),\"ERROR\",\"OK\")","v":"ERROR"}]
[]
[null,"Diversification",null,null,"*",{"$f":"D23-F6","v":0},null,{"$f":"F23-H6","v":0}]
[]
[null,"SCRdefault",null,null,"*",{"$f":"SUM(F6,F8)","v":0},null,{"$f":"SUM(H6,H8)","v":0}]
[]
[]
[null,"Best Estimate",null,"Assets",null,"VGB",null,"VDB",null,"BOF",null,"nBOF"]
[]
[null,"Base",null,{"$f":"BE_Assets","v":0},null,{"$f":"BE_Liabs_VGB","v":0},null,{"$f":"BE_Liabs_VDB","v":0},null,{"$f":"$D15-$F15-$H15","v":0},null,{"$f":"$D15-$F15-$H15","v":0},null,null,{"$f":"IF(OR('Economic Balance Sheet'!I77=\"ERROR\",'Economic Balance Sheet'!I89=\"ERROR\",'Economic Balance Sheet'!I98=\"ERROR\"),\"ERROR\",\"OK\")","v":"ERROR"}]
{"$rows_left_out":9}
{"sheet":"Life Underwriting Risk","index":11,"n_rows":66,"n_cols":19,"rows_kept":66,"cut":false,"hidden":false,"merged":[]}
[{"$f":"RIGHT(CELL(\"filename\",$A$1),LEN(CELL(\"filename\",$A$1))-FIND(\"]\",CELL(\"filename\",$A$1)))","v":"Life Underwriting Risk"}]
[{"$f":"Insurer_Name & \" (\" & Insurer_Shortname & \")\"","v":" ()"},null,null,null,null,null,null,null,null,null,null,null,null,null,null,null,null,null,{"$f":"QIS_YE_Date","v":"00:00:00"}]
[]
[null,"Life Underwriting Risk",null,null,null,"Capital",null,"nCapital"]
[]
[null,"Lifemortality",null,null,"*",{"$f":"Life_Mort","v":0},null,{"$f":"nLife_Mort","v":0},null,null,null,null,null,null,null,null,null,null,{"$f":"IF(OR($S$23=\"ERROR\",S28=\"ERROR\"),\"ERROR\",IF($S$28=\"ZERO\",\"ZERO\",\"OK\"))","v":"ERROR"}]
[null,"Lifelongevity",null,null,"*",{"$f":"Life_Long","v":0},null,{"$f":"nLife_Long","v":0},null,null,null,null,null,null,null,null,null,null,{"$f":"IF(OR($S$23=\"ERROR\",S33=\"ERROR\"),\"ERROR\",IF($S$33=\"ZERO\",\"ZERO\",\"OK\"))","v":"ERROR"}]
[null,"Lifedis+morb",null,null,"*",{"$f":"Life_Dis_Morb","v":0},null,{"$f":"nLife_Dis_Morb","v":0},null,null,null,null,null,null,null,null,null,null,{"$f":"IF($S$23=\"ERROR\",\"ERROR\",IF(OR($S$38=\"ZERO\",$S$40=\"ZERO\"),\"ZERO\",\"OK\"))","v":"ERROR"}]
[null,"Lifelapse",null,null,"*",{"$f":"Life_Lapse","v":0},null,{"$f":"nLife_Lapse","v":0},null,null,null,null,null,null,null,null,null,null,{"$f":"IF($S$23=\"ERROR\",\"ERROR\",IF($S$49=\"ZERO\",\"ZERO\",\"OK\"))","v":"ERROR"}]
[null,"Lifeexpense",null,null,"*",{"$f":"Life_Exp","v":0},null,{"$f":"nLife_Exp","v":0},null,null,null,null,null,null,null,null,null,null,{"$f":"IF(OR($S$23=\"ERROR\",S56=\"ERROR\"),\"ERROR\",IF($S$56=\"ZERO\",\"ZERO\",\"OK\"))","v":"ERROR"}]
[null,"Liferevision",null,null,"*",{"$f":"Life_Rev","v":0},null,{"$f":"nLife_Rev","v":0},null,null,null,null,null,null,null,null,null,null,{"$f":"IF($S$23=\"ERROR\",\"ERROR\",IF($S$61=\"ZERO\",\"ZERO\",\"OK\"))","v":"ERROR"}]
[null,"LifeCAT",null,null,"*",{"$f":"Life_CAT","v":0},null,{"$f":"nLife_CAT","v":0},null,null,null,null,null,null,null,null,null,null,{"$f":"IF($S$23=\"ERROR\",\"ERROR\",IF($S$66=\"ZERO\",\"ZERO\",\"OK\"))","v":"ERROR"}]
[]
[null,"Capital Requirement (before diversification effects)",null,null,null,{"$f":"SUM(F6:F12)","v":0},null,{"$f":"SUM(H6:H12)","v":0}]
[]
{"$rows_left_out":52}
{"sheet":"Health Underwriting Risk","index":12,"n_rows":67,"n_cols":19,"rows_kept":67,"cut":false,"hidden":false,"merged":[]}
[{"$f":"RIGHT(CELL(\"filename\",$A$1),LEN(CELL(\"filename\",$A$1))-FIND(\"]\",CELL(\"filename\",$A$1)))","v":"Health Underwriting Risk"}]
[{"$f":"Insurer_Name & \" (\" & Insurer_Shortname & \")\"","v":" ()"},null,null,null,null,null,null,null,null,null,null,null,null,null,null,null,null,null,{"$f":"QIS_YE_Date","v":"00:00:00"}]
[]
[null,"Health Underwriting Risk",null,null,null,"Capital",null,"nCapital"]
[]
[null,"Healthmortality",null,null,"*",{"$f":"Health_Mort","v":0},null,{"$f":"nHealth_Mort","v":0},null,null,null,null,null,null,null,null,null,null,{"$f":"IF(OR($S$26=\"ERROR\",S31=\"ERROR\"),\"ERROR\",IF($S$31=\"ZERO\",\"ZERO\",\"OK\"))","v":"ERROR"}]
[null,"Healthlongevity",null,null,"*",{"$f":"Health_Long","v":0},null,{"$f":"nHealth_Long","v":0},null,null,null,null,null,null,null,null,null,null,{"$f":"IF(OR($S$26=\"ERROR\",S36=\"ERROR\"),\"ERROR\",IF($S$36=\"ZERO\",\"ZERO\",\"OK\"))","v":"ERROR"}]
[null,"Healthdis+morb",null,null,"*",{"$f":"Health_Dis_Morb","v":0},null,{"$f":"nHealth_Dis_Morb","v":0},null,null,null,null,null,null,null,null,null,null,{"$f":"IF($S$26=\"ERROR\",\"ERROR\",IF(OR($S$44=\"ZERO\",$S$46=\"ZERO\"),\"ZERO\",\"OK\"))","v":"ERROR"}]
[null,"Healthlapse",null,null,"*",{"$f":"Health_Lapse","v":0},null,{"$f":"nHealth_Lapse","v":0},null,null,null,null,null,null,null,null,null,null,{"$f":"IF($S$26=\"ERROR\",\"ERROR\",IF($S$55=\"ZERO\",\"ZERO\",\"OK\"))","v":"ERROR"}]
[null,"Healthexpense",null,null,"*",{"$f":"Health_Exp","v":0},null,{"$f":"nHealth_Exp","v":0},null,null,null,null,null,null,null,null,null,null,{"$f":"IF(OR($S$26=\"ERROR\",S62=\"ERROR\"),\"ERROR\",IF($S$62=\"ZERO\",\"ZERO\",\"OK\"))","v":"ERROR"}]
[null,"Healthrevision",null,null,"*",{"$f":"Health_Rev","v":0},null,{"$f":"nHealth_Rev","v":0},null,null,null,null,null,null,null,null,null,null,{"$f":"IF($S$26=\"ERROR\",\"ERROR\",IF($S$67=\"ZERO\",\"ZERO\",\"OK\"))","v":"ERROR"}]
[]
[null,"HealthSLT",null,null,"*",{"$f":"SQRT(MMULT(MMULT(TRANSPOSE(F6:F11),HealthCorr_SLT),F6:F11))","v":0},null,{"$f":"SQRT(MMULT(MMULT(TRANSPOSE(H6:H11),HealthCorr_SLT),H6:H11))","v":0},null,null,null,null,null,null,null,null,null,null,{"$f":"IF(OR(F13=0,H13=0),\"ZERO\",IF(OR(F13<0,H13<0),\"ERROR\",\"OK\"))","v":"ZERO"}]
[null,"HealthCAT",null,null,"*",{"$f":"'Raw Data'!I319","v":0},null,{"$f":"'Raw Data'!I320","v":0},null,null,null,null,null,null,null,null,null,null,{"$f":"IF(OR(F14=0,H14=0),\"ZERO\",IF(OR(F14<0,H14<0),\"ERROR\",\"OK\"))","v":"ZERO"}]
[null,"HealthNonSLT",null,null," *",{"$f":"'Raw Data'!I321","v":0},null,{"$f":"'Raw Data'!I322","v":0},null,null,null,null,null,null,null,null,null,null,{"$f":"IF(OR(F15=0,H15=0),\"ZERO\",IF(OR(F15<0,H15<0),\"ERROR\",\"OK\"))","v":"ZERO"}]
{"$rows_left_out":53}
{"sheet":"Data","index":13,"n_rows":161,"n_cols":17,"rows_kept":161,"cut":false,"hidden":false,"merged":[[94,1,94,2],[95,1,95,2],[96,1,96,2]]}
[{"$f":"RIGHT(CELL(\"filename\",$A$1),LEN(CELL(\"filename\",$A$1))-FIND(\"]\",CELL(\"filename\",$A$1)))","v":"Data"}]
[]
[]
[null,"Currency","Currency Code"]
[null,"United Kingdom Pound","GBP"]
[null,"United States Dollar","USD"]
[null,"Euro","EUR"]
[null,"Sweden Krona","SEK"]
[null,"Afghanistan Afghani","AFN"]
[null,"Albania Lek","ALL"]
[null,"Algeria Dinar","DZD"]
[null,"Argentina Peso","ARS"]
[null,"Australia Dollar","AUD"]
[null,"Bahamas Dollar","BSD"]
[null,"Bahrain Dinar","BHD"]
{"$rows_left_out":147}
{"sheet":"Raw Data","index":14,"n_rows":322,"n_cols":9,"rows_kept":322,"cut":false,"hidden":false,"merged":[]}
[{"$f":"RIGHT(CELL(\"filename\",$A$1),LEN(CELL(\"filename\",$A$1))-FIND(\"]\",CELL(\"filename\",$A$1)))","v":"Raw Data"}]
[]
[]
[null,"Sheet","Result",1,2,3,4,5,"Total"]
[null,"Operational Risk Sheet","2016 YE - Renewal Commission",0,null,null,null,null,{"$f":"SUM(D5:H5)","v":0}]
[null,"Operational Risk Sheet","2016 YE - Investment Management Expenses",0,null,null,null,null,0]
[null,"Operational Risk Sheet","2016 YE - One-off expenses/ development costs",0,null,null,null,null,0]
[null,"Operational Risk Sheet","2016 YE - Fixed expenses/ overheads",0,null,null,null,null,0]
[null,"Operational Risk Sheet","2016 YE - Other expenses",0,null,null,null,null,0]
[null,"Operational Risk Sheet","2015 YE - Renewal Commission",0,null,null,null,null,0]
[null,"Operational Risk Sheet","2015 YE - Investment Management Expenses",0,null,null,null,null,0]
[null,"Operational Risk Sheet","2015 YE - One-off expenses/ development costs",0,null,null,null,null,0]
[null,"Operational Risk Sheet","2015 YE - Fixed expenses/ overheads",0,null,null,null,null,0]
[null,"Operational Risk Sheet","2015 YE - Other expenses",0,null,null,null,null,0]
[null,"Operational Risk Sheet","2016  YE Earned Premiums ",0,null,null,null,null,0]
{"$rows_left_out":307}