{"text_format":"1","workbook":"xlsx","n_sheets":14,"sheets":["Index","Participant Information","Control","SCR Summary","MCR Summary","Regulatory Balance Sheet","Own Funds","Operational Risk","Market Risk","Counterparty Default Risk","Life Underwriting Risk","Health Underwriting Risk","Data","Raw Data"],"not_rendered":{"charts":0,"images":0,"macros":1,"external_links":1,"defined_names":396,"comments":1,"pivot_tables":0},"unopened":[],"bounds":{"document_bytes":16777216,"sheet_cells":100000,"rows_first":2000,"rows_last":500,"rows_between":2000,"halvings":0,"cell_chars":16384,"cell_head_chars":4096},"cells_cut":0,"cells_raw":0,"read":"whole","date_system":"1900"}

{"sheet":"Index","index":0,"n_rows":55,"n_cols":6,"rows_kept":55,"cut":false,"hidden":false,"merged":[[54,3,54,5],[3,0,3,16383],[5,0,5,16383],[44,3,44,5],[46,3,46,5],[48,3,48,5],[50,3,50,5],[52,3,52,5],[36,3,36,5],[38,3,38,5],[40,3,40,5],[42,3,42,5],[13,0,13,16383],[15,0,15,16383],[32,3,32,5],[34,3,34,5],[7,0,7,16383],[9,0,9,16383],[11,0,11,16383]]}
[{"$f":"RIGHT(CELL(\"filename\",$A$1),LEN(CELL(\"filename\",$A$1))-FIND(\"]\",CELL(\"filename\",$A$1)))","v":"Index"}]
[{"$f":"Insurer_Name & \" (\" & Insurer_Shortname & \")\"","v":" ()"},null,null,null,null,{"$f":"QIS_YE_Date","v":"00:00:00"}]
[]
["Throughout this RER form, 'Regulation' refers to the Insurance (Long-Term Business Valuation and Solvency) Regulations 2018 unless stated otherwise. "]
[]
["Where applicable, the terms used in this form should be taken to have the same meaning as defined in the Regulations."]
[]
["This Regulatory Electronic Return (\"RER\"), \"RER_LT1_SCR_Form_6_Total_Insurer Shortname\" should be completed by the insurer for assets and liabilities relating to all its lines of business."]
[]
["In accordance with Regulation 14 of the Insurance Regulations 2018, all of the following should be submitted to the Authority:                                                                                                                                                                                     a) this RER form;                                                                                                                                                                                     b) where applicable to the insurer, the RER 'RER_LT1_SCR_Form_X_Insurer Shortname' forms for the 5 lines of business.                                                                                                                                                                                                                                                                                                                                                                                         "]
[]
["This RER form must be completed in the reporting currency of the insurer. "]
[]
["When expressing the value of any asset or liability denominated in a currency other than the reporting currency, the value shall be converted into the reporting currency as if the conversion had taken place at the closing exchange rate on the last day for which the appropriate rate is available in the reporting period to which the asset or liability relates. "]
[]
["The conversion into the reporting currency shall be calculated by applying the exchange rate from the same source as that used for the insurer's financial statements."]
[]
[null,null,null,null,null,"Key"]
[]
[null,null,null,null,null,"Input Cell"]
{"$rows_left_out":36}
{"sheet":"Participant Information","index":1,"n_rows":31,"n_cols":10,"rows_kept":31,"cut":false,"hidden":false,"merged":[[9,3,9,5],[30,3,30,6],[14,3,14,6],[25,3,25,4],[21,3,21,5],[23,3,23,6]]}
[{"$f":"RIGHT(CELL(\"filename\",$A$1),LEN(CELL(\"filename\",$A$1))-FIND(\"]\",CELL(\"filename\",$A$1)))","v":"Participant Information"}]
[{"$f":"Insurer_Name & \" (\" & Insurer_Shortname & \")\"","v":" ()"},null,null,null,null,null,null,null,null,{"$f":"QIS_YE_Date","v":"00:00:00"}]
[]
[null," Information"]
[]
[null,"Date of submission"]
[]
[null,"Financial year end used"]
[]
[null,"Reporting currency",null,null,null,null,{"$f":"OFFSET(Data!C5,MATCH(D10,Data!B5:B76,0)-1,)","v":{"$error":"#N/A"}}]
[]
[]
[null,"Insurer Information"]
[]
[null,"Insurer Name"]
[]
[null,"Insurer Shortname"]
[]
[]
[null,"Contact Information"]
{"$rows_left_out":12}
{"sheet":"Control","index":2,"n_rows":20,"n_cols":7,"rows_kept":20,"cut":false,"hidden":false,"merged":[[15,2,15,6],[16,2,16,6],[17,2,17,6],[18,2,18,6],[19,2,19,6]]}
[{"$f":"RIGHT(CELL(\"filename\",$A$1),LEN(CELL(\"filename\",$A$1))-FIND(\"]\",CELL(\"filename\",$A$1)))","v":"Control"}]
[{"$f":"Insurer_Name & \" (\" & Insurer_Shortname & \")\"","v":" ()"},null,null,null,null,null,{"$f":"QIS_YE_Date","v":"00:00:00"}]
[]
[]
[null,null,"File Name",null,"Folder Location",null,"Applicable?*"]
[]
[]
[]
[]
[]
[]
[]
[]
[null,null,"File path for RER Form"]
[]
[null,null,{"$f":"IF(G7=\"Yes\",IF(RIGHT(E7,1)=\"\\\",E7&C7&\".xlsx\",E7&\"\\\"&C7&\".xlsx\"),\"\")","v":""}]
[null,null,{"$f":"IF(G8=\"Yes\",IF(RIGHT(E8,1)=\"\\\",E8&C8&\".xlsx\",E8&\"\\\"&C8&\".xlsx\"),\"\")","v":""}]
[null,null,""]
[null,null,""]
[null,null,""]
{"$rows_left_out":1}
{"sheet":"SCR Summary","index":3,"n_rows":51,"n_cols":18,"rows_kept":51,"cut":false,"hidden":false,"merged":[]}
[{"$f":"RIGHT(CELL(\"filename\",$A$1),LEN(CELL(\"filename\",$A$1))-FIND(\"]\",CELL(\"filename\",$A$1)))","v":"SCR Summary"}]
[{"$f":"Insurer_Name & \" (\" & Insurer_Shortname & \")\"","v":" ()"},null,null,null,null,null,null,null,null,null,{"$f":"QIS_YE_Date","v":"00:00:00"}]
[null,null,null,null,null,null,null,null,null,null,null,null,null,"For info"]
[null,"Solvency Capital Requirement",null,null,null,"Capital",null,"nCapital",null,null,null,null,null,"Solvency Capital Requirement (25% Op Risk)",null,null,null,"Capital"]
[null,null,null,null,null,{"$f":"\"'000\"","v":"'000"},null,{"$f":"\"'000\"","v":"'000"}]
[]
[null,"SCRmarket",null,null,null,{"$f":"SCR_Market","v":0},null,{"$f":"nSCR_Market","v":0},null,null,null,null,null,"SCRmarket",null,null,null,{"$f":"SCR_Market","v":0}]
[null,"SCRdefault",null,null,null,{"$f":"SCR_Default","v":0},null,{"$f":"nSCR_Default","v":0},null,null,null,null,null,"SCRdefault",null,null,null,{"$f":"SCR_Default","v":0}]
[null,"SCRlife",null,null,null,{"$f":"SCR_Life","v":0},null,{"$f":"nSCR_Life","v":0},null,null,null,null,null,"SCRlife",null,null,null,{"$f":"SCR_Life","v":0}]
[null,"SCRhealth",null,null,null,{"$f":"'Health Underwriting Risk'!SCR_Health","v":0},null,{"$f":"'Health Underwriting Risk'!nSCR_Health","v":0},null,null,null,null,null,"SCRhealth",null,null,null,{"$f":"'Health Underwriting Risk'!SCR_Health","v":0}]
[null,"SCRintangibles",null,null,null,{"$f":"0.8*'Regulatory Balance Sheet'!$F$10","v":0},null,{"$f":"0.8*'Regulatory Balance Sheet'!$F$10","v":0},null,null,null,null,null,"SCRintangibles",null,null,"*",{"$f":"0.8*'Regulatory Balance Sheet'!$F$10","v":0}]
[]
[null,"BSCR (before diversification effects)",null,null,null,{"$f":"SUM(F7:F11)","v":0},null,{"$f":"SUM(H7:H11)","v":0},null,null,null,null,null,"BSCR (before diversification effects)",null,null,null,{"$f":"SUM(R7:R11)","v":0}]
[]
[null,"Diversification",null,null,null,{"$f":"SQRT(MMULT(MMULT(TRANSPOSE(F7:F10),Corr),F7:F10))-SUM(F7:F10)","v":0},null,{"$f":"SQRT(MMULT(MMULT(TRANSPOSE(H7:H10),Corr),H7:H10))-SUM(H7:H10)","v":0},null,null,null,null,null,"Diversification",null,null,"*",{"$f":"SQRT(MMULT(MMULT(TRANSPOSE(R7:R10),Corr),R7:R10))-SUM(R7:R10)","v":0}]
[]
[null,"BSCR",null,null,null,{"$f":"SUM(F13,F15)","v":0},null,{"$f":"SUM(H13,H15)","v":0},null,null,null,null,null,"BSCR",null,null,null,{"$f":"SUM(R13,R15)","v":0}]
[]
[null,"SCROp_UL",null,null,null,{"$f":"EXPul","v":0},null,{"$f":"SCR_Op_UL","v":0},null,null,null,null,null,"SCROp_risk",null,null,"*",{"$f":"SCR_Op_UL*1/3","v":0}]
[]
{"$rows_left_out":32}
{"sheet":"MCR Summary","index":4,"n_rows":31,"n_cols":9,"rows_kept":31,"cut":false,"hidden":false,"merged":[]}
[{"$f":"RIGHT(CELL(\"filename\",$A$1),LEN(CELL(\"filename\",$A$1))-FIND(\"]\",CELL(\"filename\",$A$1)))","v":"MCR Summary"}]
[{"$f":"Insurer_Name & \" (\" & Insurer_Shortname & \")\"","v":" ()"},null,null,null,null,null,null,null,{"$f":"QIS_YE_Date","v":"00:00:00"}]
[]
[null,"Minimum Capital Requirement",null,null,null,{"$f":"\"'000\"","v":"'000"}]
[]
[null,"SCR",null,null,null,{"$f":"SCR","v":0}]
[null,"SCRnoMA",null,null,null,{"$f":"'SCR Summary'!F34","v":0}]
[]
[null,"MCRSCR",null,null,null,{"$f":"MAX(0.35*F6,0.25*F7)","v":0}]
[null,"FMCR",null,null,null,3000]
[]
[null,"MCR",null,null,null,{"$f":"MAX(F9,F10)","v":3000}]
[]
[null,"Regulatory Adjustment"]
[]
[null,"MCR",null,null,"*",{"$f":"F12+F14","v":3000}]
[]
[]
[null,"Eligible Capital Resources",null,null,null,{"$f":"\"'000\"","v":"'000"}]
[]
{"$rows_left_out":12}
{"sheet":"Regulatory Balance Sheet","index":5,"n_rows":164,"n_cols":9,"rows_kept":164,"cut":false,"hidden":false,"merged":[]}
[{"$f":"RIGHT(CELL(\"filename\",$A$1),LEN(CELL(\"filename\",$A$1))-FIND(\"]\",CELL(\"filename\",$A$1)))","v":"Regulatory Balance Sheet"}]
[{"$f":"Insurer_Name & \" (\" & Insurer_Shortname & \")\"","v":" ()"},null,null,null,null,null,null,null,{"$f":"QIS_YE_Date","v":"00:00:00"}]
[]
[null,"Balance Sheet - Assets",null,"Accounting basis        *",null,"Regulatory basis        *"]
[null,null,null,{"$f":"\"'000\"","v":"'000"},null,{"$f":"\"'000\"","v":"'000"}]
[]
[null,"Fixed Assets"]
[]
[null,"Goodwill",null,{"$f":"'Raw Data'!$I$11","v":0},null,0]
[null,"Other intangible assets",null,{"$f":"'Raw Data'!$I$12","v":0},null,{"$f":"'Raw Data'!$I$13","v":0}]
[null,"Property, plant & equipment held for own use",null,{"$f":"'Raw Data'!$I$14","v":0},null,{"$f":"'Raw Data'!$I$15","v":0}]
[]
[null,"Total",null,{"$f":"SUM(D9:D11)","v":0},null,{"$f":"SUM(F9:F11)","v":0}]
[]
[null,"Investments (other than assets held for unit-linked funds)"]
[]
[null,"Property (other than for own use)",null,{"$f":"'Raw Data'!$I$16","v":0},null,{"$f":"'Raw Data'!$I$17","v":0}]
[null,"Participations",null,{"$f":"'Raw Data'!$I$18","v":0},null,{"$f":"'Raw Data'!$I$19","v":0}]
[null,"Listed equities/other shares (other than participations)",null,{"$f":"'Raw Data'!$I$20","v":0},null,{"$f":"'Raw Data'!$I$21","v":0}]
[null,"Unlisted equities/other shares (other than participations)",null,{"$f":"'Raw Data'!$I$22","v":0},null,{"$f":"'Raw Data'!$I$23","v":0}]
{"$rows_left_out":145}
{"sheet":"Own Funds","index":6,"n_rows":128,"n_cols":13,"rows_kept":128,"cut":false,"hidden":false,"merged":[]}
[{"$f":"RIGHT(CELL(\"filename\",$A$1),LEN(CELL(\"filename\",$A$1))-FIND(\"]\",CELL(\"filename\",$A$1)))","v":"Own Funds"}]
[{"$f":"Insurer_Name & \" (\" & Insurer_Shortname & \")\"","v":" ()"},null,null,null,null,null,null,null,null,null,null,null,{"$f":"QIS_YE_Date","v":"00:00:00"}]
[]
[null,"Basic Own Funds *",null,"Tier 1",null,"Tier 2",null,"Tier 3",null,"Total"]
[null,null,null,{"$f":"\"'000\"","v":"'000"},null,{"$f":"\"'000\"","v":"'000"},null,{"$f":"\"'000\"","v":"'000"},null,{"$f":"\"'000\"","v":"'000"}]
[]
[null,"Ordinary Share Capital (net of own shares)"]
[]
[null,"Paid up",null,null,null,null,null,0,null,{"$f":"SUM(D9,F9,H9)","v":0}]
[null,"Called up",null,0,null,null,null,0,null,{"$f":"SUM(D10,F10,H10)","v":0}]
[]
[null,"Total",null,{"$f":"SUM(D9:D10)","v":0},null,{"$f":"SUM(F9:F10)","v":0},null,{"$f":"SUM(H9:H10)","v":0},null,{"$f":"SUM(J9:J10)","v":0}]
[]
[null,"Initial Fund (less item of the same type held)"]
[]
[null,"Paid up",null,null,null,null,null,null,null,{"$f":"SUM(D16,F16,H16)","v":0}]
[null,"Called up",null,0,null,null,null,null,null,{"$f":"SUM(D17,F17,H17)","v":0}]
[null,"Callable",null,0,null,null,null,null,null,{"$f":"SUM(D18,F18,H18)","v":0}]
[]
[null,"Total",null,{"$f":"SUM(D16:D18)","v":0},null,{"$f":"SUM(F16:F18)","v":0},null,{"$f":"SUM(H16:H18)","v":0},null,{"$f":"SUM(J16:J18)","v":0}]
{"$rows_left_out":109}
{"sheet":"Operational Risk","index":7,"n_rows":11,"n_cols":15,"rows_kept":11,"cut":false,"hidden":false,"merged":[]}
[{"$f":"RIGHT(CELL(\"filename\",$A$1),LEN(CELL(\"filename\",$A$1))-FIND(\"]\",CELL(\"filename\",$A$1)))","v":"Operational Risk"}]
[{"$f":"Insurer_Name & \" (\" & Insurer_Shortname & \")\"","v":" ()"},null,null,null,null,null,null,null,null,null,null,null,null,null,{"$f":"QIS_YE_Date","v":"00:00:00"}]
[]
[null,"Operational Risk",null,null,"Current Valuation Date",null,"Previous Valuation Date",null,null,"EXPUL",null,null,"OpPremiums",null,"OpProvisions"]
[null,null,null,null,{"$f":"\"'000\"","v":"'000"},null,{"$f":"\"'000\"","v":"'000"},null,null,{"$f":"\"'000\"","v":"'000"},null,null,{"$f":"\"'000\"","v":"'000"},null,{"$f":"\"'000\"","v":"'000"}]
[]
[null,null,"Total expenses allocated to Unit Linked business",null,{"$f":"'Raw Data'!I6","v":0},null,null,null,null,{"$f":"E7","v":0}]
[]
[null,null,"Earned Premiums ",null,{"$f":"'Raw Data'!I7","v":0},null,{"$f":"'Raw Data'!I8","v":0},null,null,null,null,null,{"$f":"(0.04*E9)+MAX(0,0.04*(E9-1.2*G9))","v":0}]
[]
[null,null,"Technical Provisions ",null,{"$f":"'Raw Data'!I9","v":0},null,null,null,null,null,null,null,null,null,{"$f":"0.0045*MAX(E11,0)","v":0}]

{"sheet":"Market Risk","index":8,"n_rows":159,"n_cols":19,"rows_kept":159,"cut":false,"hidden":false,"merged":[]}
[{"$f":"RIGHT(CELL(\"filename\",$A$1),LEN(CELL(\"filename\",$A$1))-FIND(\"]\",CELL(\"filename\",$A$1)))","v":"Market Risk"}]
[{"$f":"Insurer_Name & \" (\" & Insurer_Shortname & \")\"","v":" ()"},null,null,null,null,null,null,null,null,null,null,null,null,null,null,null,null,null,{"$f":"QIS_YE_Date","v":"00:00:00"}]
[]
[null,"Market Risk",null,null,null,"Capital",null,"nCapital"]
[null,null,null,null,null,{"$f":"\"'000\"","v":"'000"},null,{"$f":"\"'000\"","v":"'000"}]
[]
[null,"Marketinterest",null,null,null,{"$f":"Mkt_Int","v":0},null,{"$f":"nMkt_Int","v":0}]
[null,"Marketequity",null,null,null,{"$f":"Mkt_Eq","v":0},null,{"$f":"nMkt_Eq","v":0}]
[null,"Marketproperty",null,null,null,{"$f":"Mkt_Prop","v":0},null,{"$f":"nMkt_Prop","v":0}]
[null,"Marketfx",null,null,null,{"$f":"IF(Curr_Simp=\"N\",Mkt_Curr,IF(Curr_Simp=\"Y\",Mkt_Curr_Simp,0))","v":0},null,{"$f":"IF(Curr_Simp=\"N\",nMkt_Curr,IF(Curr_Simp=\"Y\",nMkt_Curr_Simp,0))","v":0}]
[null,"Marketspread",null,null,null,{"$f":"Mkt_Sp","v":0},null,{"$f":"nMkt_Sp","v":0}]
[null,"Marketconc",null,null,null,{"$f":"Mkt_Conc","v":0},null,{"$f":"nMkt_Conc","v":0}]
[]
[null,"Capital Requirement (before diversification effects)",null,null,null,{"$f":"SUM(F7:F12)","v":0},null,{"$f":"SUM(H7:H12)","v":0}]
[]
[null,"Diversification",null,null,null,{"$f":"F18-F14","v":0},null,{"$f":"H18-H14","v":0}]
[]
[null,"SCRmarket",null,null,null,{"$f":"SQRT(MMULT(MMULT(TRANSPOSE(F7:F12),MarketCorr),F7:F12))","v":0},null,{"$f":"SQRT(MMULT(MMULT(TRANSPOSE(H7:H12),MarketCorr),H7:H12))","v":0}]
[]
[]
{"$rows_left_out":140}
{"sheet":"Counterparty Default Risk","index":9,"n_rows":26,"n_cols":15,"rows_kept":26,"cut":false,"hidden":false,"merged":[]}
[{"$f":"RIGHT(CELL(\"filename\",$A$1),LEN(CELL(\"filename\",$A$1))-FIND(\"]\",CELL(\"filename\",$A$1)))","v":"Counterparty Default Risk"}]
[{"$f":"Insurer_Name & \" (\" & Insurer_Shortname & \")\"","v":" ()"},null,null,null,null,null,null,null,null,null,null,null,null,null,{"$f":"QIS_YE_Date","v":"00:00:00"}]
[]
[null,"Counterparty Default Risk",null,null,null,"Capital",null,"nCapital"]
[null,null,null,null,null,{"$f":"\"'000\"","v":"'000"},null,{"$f":"\"'000\"","v":"'000"}]
[]
[null,"Capital Requirement (before diversification effects)",null,null,null,{"$f":"SUM(D23:D24)","v":0},null,{"$f":"SUM(F23:F24)","v":0}]
[]
[null,"Diversification",null,null,null,{"$f":"D26-F7","v":0},null,{"$f":"F26-H7","v":0}]
[]
[null,"SCRdefault",null,null,null,{"$f":"SUM(F7,F9)","v":0},null,{"$f":"SUM(H7,H9)","v":0}]
[]
[]
[null,"Best Estimate",null,"Assets",null,"VGB",null,"VDB",null,"BOF",null,"nBOF"]
[null,null,null,{"$f":"\"'000\"","v":"'000"},null,{"$f":"\"'000\"","v":"'000"},null,{"$f":"\"'000\"","v":"'000"},null,{"$f":"\"'000\"","v":"'000"},null,{"$f":"\"'000\"","v":"'000"}]
[]
[null,"Base",null,{"$f":"BE_Assets","v":0},null,{"$f":"BE_Liabs_VGB","v":0},null,{"$f":"BE_Liabs_VDB","v":0},null,{"$f":"$D17-$F17-$H17","v":0},null,{"$f":"$D17-$F17-$H17","v":0}]
[]
[]
[null,"Counterparty Default Risk",null,"Capital",null,"nCapital"]
{"$rows_left_out":7}
{"sheet":"Life Underwriting Risk","index":10,"n_rows":75,"n_cols":19,"rows_kept":75,"cut":false,"hidden":false,"merged":[]}
[{"$f":"RIGHT(CELL(\"filename\",$A$1),LEN(CELL(\"filename\",$A$1))-FIND(\"]\",CELL(\"filename\",$A$1)))","v":"Life Underwriting Risk"}]
[{"$f":"Insurer_Name & \" (\" & Insurer_Shortname & \")\"","v":" ()"},null,null,null,null,null,null,null,null,null,null,null,null,null,null,null,null,null,{"$f":"QIS_YE_Date","v":"00:00:00"}]
[]
[null,"Life Underwriting Risk",null,null,null,"Capital",null,"nCapital"]
[null,null,null,null,null,{"$f":"\"'000\"","v":"'000"},null,{"$f":"\"'000\"","v":"'000"}]
[]
[null,"Lifemortality",null,null,null,{"$f":"Life_Mort","v":0},null,{"$f":"nLife_Mort","v":0}]
[null,"Lifelongevity",null,null,null,{"$f":"Life_Long","v":0},null,{"$f":"nLife_Long","v":0}]
[null,"Lifedis+morb",null,null,null,{"$f":"Life_Dis_Morb","v":0},null,{"$f":"nLife_Dis_Morb","v":0}]
[null,"Lifelapse",null,null,null,{"$f":"Life_Lapse","v":0},null,{"$f":"nLife_Lapse","v":0}]
[null,"Lifeexpense",null,null,null,{"$f":"Life_Exp","v":0},null,{"$f":"nLife_Exp","v":0}]
[null,"Liferevision",null,null,null,{"$f":"Life_Rev","v":0},null,{"$f":"nLife_Rev","v":0}]
[null,"LifeCAT",null,null,null,{"$f":"Life_CAT","v":0},null,{"$f":"nLife_CAT","v":0}]
[]
[null,"Capital Requirement (before diversification effects)",null,null,null,{"$f":"SUM(F7:F13)","v":0},null,{"$f":"SUM(H7:H13)","v":0}]
[]
[null,"Diversification",null,null,null,{"$f":"F19-F15","v":0},null,{"$f":"H19-H15","v":0}]
[]
[null,"SCRlife",null,null,null,{"$f":"SQRT(MMULT(MMULT(TRANSPOSE(F7:F13),LifeCorr),F7:F13))","v":0},null,{"$f":"SQRT(MMULT(MMULT(TRANSPOSE(H7:H13),LifeCorr),H7:H13))","v":0}]
[]
{"$rows_left_out":56}
{"sheet":"Health Underwriting Risk","index":11,"n_rows":75,"n_cols":19,"rows_kept":75,"cut":false,"hidden":false,"merged":[]}
[{"$f":"RIGHT(CELL(\"filename\",$A$1),LEN(CELL(\"filename\",$A$1))-FIND(\"]\",CELL(\"filename\",$A$1)))","v":"Health Underwriting Risk"}]
[{"$f":"Insurer_Name & \" (\" & Insurer_Shortname & \")\"","v":" ()"},null,null,null,null,null,null,null,null,null,null,null,null,null,null,null,null,null,{"$f":"QIS_YE_Date","v":"00:00:00"}]
[]
[null,"Health Underwriting Risk",null,null,null,"Capital",null,"nCapital"]
[null,null,null,null,null,{"$f":"\"'000\"","v":"'000"},null,{"$f":"\"'000\"","v":"'000"}]
[]
[null,"Healthmortality",null,null,null,{"$f":"Health_Mort","v":0},null,{"$f":"nHealth_Mort","v":0}]
[null,"Healthlongevity",null,null,null,{"$f":"Health_Long","v":0},null,{"$f":"nHealth_Long","v":0}]
[null,"Healthdis+morb",null,null,null,{"$f":"Health_Dis_Morb","v":0},null,{"$f":"nHealth_Dis_Morb","v":0}]
[null,"Healthlapse",null,null,null,{"$f":"Health_Lapse","v":0},null,{"$f":"nHealth_Lapse","v":0}]
[null,"Healthexpense",null,null,null,{"$f":"Health_Exp","v":0},null,{"$f":"nHealth_Exp","v":0}]
[null,"Healthrevision",null,null,null,{"$f":"Health_Rev","v":0},null,{"$f":"nHealth_Rev","v":0}]
[]
[null,"HealthSLT",null,null,null,{"$f":"SQRT(MMULT(MMULT(TRANSPOSE(F7:F12),HealthCorr_SLT),F7:F12))","v":0},null,{"$f":"SQRT(MMULT(MMULT(TRANSPOSE(H7:H12),HealthCorr_SLT),H7:H12))","v":0}]
[null,"HealthCAT",null,null,null,{"$f":"'Raw Data'!I311","v":0},null,{"$f":"'Raw Data'!I312","v":0}]
[null,"HealthNSLT",null,null,null,{"$f":"'Raw Data'!I313","v":0},null,{"$f":"'Raw Data'!I314","v":0}]
[]
[null,"Capital Requirement (before diversification effects)",null,null,null,{"$f":"SUM(F14:F16)","v":0},null,{"$f":"SUM(H14:H16)","v":0}]
[]
[null,"Diversification",null,null,null,{"$f":"F22-F18","v":0},null,{"$f":"H22-H18","v":0}]
{"$rows_left_out":56}
{"sheet":"Data","index":12,"n_rows":161,"n_cols":17,"rows_kept":161,"cut":false,"hidden":false,"merged":[[94,1,94,2],[95,1,95,2],[96,1,96,2]]}
[{"$f":"RIGHT(CELL(\"filename\",$A$1),LEN(CELL(\"filename\",$A$1))-FIND(\"]\",CELL(\"filename\",$A$1)))","v":"Data"}]
[]
[]
[null,"Currency","Currency Code"]
[null,"United Kingdom Pound","GBP"]
[null,"United States Dollar","USD"]
[null,"Euro","EUR"]
[null,"Sweden Krona","SEK"]
[null,"Afghanistan Afghani","AFN"]
[null,"Albania Lek","ALL"]
[null,"Algeria Dinar","DZD"]
[null,"Argentina Peso","ARS"]
[null,"Australia Dollar","AUD"]
[null,"Bahamas Dollar","BSD"]
[null,"Bahrain Dinar","BHD"]
[null,"Bangladesh Taka","BDT"]
[null,"Barbados Dollar","BBD"]
[null,"Bermuda Dollar","BMD"]
[null,"Brazil Real","BRL"]
[null,"Bulgaria Lev","BGN"]
{"$rows_left_out":142}
{"sheet":"Raw Data","index":13,"n_rows":314,"n_cols":9,"rows_kept":314,"cut":false,"hidden":false,"merged":[]}
[{"$f":"RIGHT(CELL(\"filename\",$A$1),LEN(CELL(\"filename\",$A$1))-FIND(\"]\",CELL(\"filename\",$A$1)))","v":"Raw Data"}]
[]
[]
[null,"Sheet","Result",1,2,3,4,5,"Total"]
[]
[null,"Operational Risk Sheet","Current valuation date - Total  expenses for UL business",null,null,null,null,null,{"$f":"SUM(D6:H6)","v":0}]
[null,"Operational Risk Sheet","Current valuation date - Earned premiums ",null,null,null,null,null,{"$f":"SUM(D7:H7)","v":0}]
[null,"Operational Risk Sheet","Previous valuation date - Earned premiums ",null,null,null,null,null,0]
[null,"Operational Risk Sheet","Technical Provisions",null,null,null,null,null,0]
[]
[null,"Economic Balance Sheet","Goodwill - Acc.",null,null,null,null,null,{"$f":"SUM(D11:H11)","v":0}]
[null,"Economic Balance Sheet","Other Intangible assets - Acc.",null,null,null,null,null,0]
[null,"Economic Balance Sheet","Other Intangible assets - Reg.",null,null,null,null,null,0]
[null,"Economic Balance Sheet","Property (own use) - Acc.",null,null,null,null,null,0]
[null,"Economic Balance Sheet","Property (own use) - Reg.",null,null,null,null,null,0]
[null,"Economic Balance Sheet","Property (not own use) - Acc.",null,null,null,null,null,0]
[null,"Economic Balance Sheet","Property (not own use) - Reg.",null,null,null,null,null,0]
[null,"Economic Balance Sheet","Participations - Acc.",null,null,null,null,null,0]
[null,"Economic Balance Sheet","Participations - Reg.",null,null,null,null,null,0]
[null,"Economic Balance Sheet","Listed equities - Acc.",null,null,null,null,null,0]
{"$rows_left_out":294}